{"text_format":"1","workbook":"xlsx","n_sheets":6,"sheets":["Instructions","Optimizer","Report","Materials","HiddenSheet","Documentation"],"not_rendered":{"charts":0,"images":2,"macros":1,"external_links":0,"defined_names":375,"comments":3,"pivot_tables":0},"unopened":[],"bounds":{"document_bytes":16777216,"sheet_cells":100000,"rows_first":2000,"rows_last":500,"rows_between":2000,"halvings":0,"cell_chars":16384,"cell_head_chars":4096},"cells_cut":0,"cells_raw":0,"read":"whole","date_system":"1900"}

{"sheet":"Instructions","index":0,"n_rows":52,"n_cols":2,"rows_kept":52,"cut":false,"hidden":false,"merged":[]}
[]
[null,"Instructions for Spartan Compost Recipe Optimizer"]
[null,"version 1.05  2018"]
[]
[null,"1.  Overview"]
[null,"Spartan Compost Recipe Optimizer is a Microsoft® Office Excel application that simplifies planning a compost recipe or mix.  The spreadsheet will work in the preparation of most compost mixes."]
[null,"The application uses Excel's Solver to automate the process of developing or formulating a compost recipe.  The amounts of materials to be used in a compost mix are determined based on meeting compost performance constraints (a.k.a. nutrient balance, compost characteristics, or compost conditions) while minimizing cost.  Material constraints and costs can be set to limit the amount of specific ingredients that are used in the mix.  Performance constraints or targets are set for percent moisture, carbon nitrogen ratio (C:N), and (or) bulk density. "]
[null,"Spartan Compost Recipe Optimizer was developed by Dr. Dale Rozeboom (Department of Animal Science, Michigan State University) and Robert Kriegel M.S. (ANR Technology Services, Michigan State University). Dean Ross (Agrosecurity Consulting) collaborated in revisions made in version 1.03."]
[null,"Copyright © 2013 Michigan State University Board of Trustees.  All Rights Reserved."]
[null,"The Excel workbook contains the following worksheets:"]
[null,"Instructions.  This sheet contains instructions for using Spartan Compost Recipe Optimizer."]
[null,"Optimizer.  Use this sheet to select materials used in the compost mix, set material and performance constraints, and run the Solver to optimize the mix.  Alternatively, the amounts of materials in a compost mix can also be entered manually."]
[null,"Report.  Use this sheet to print a batch report when preparing the compost recipe."]
[null,"Materials. This sheet contains a library of materials that can be used in a compost mix.  Normally, there will be no need to modify this sheet.  However, if the addition of new materials to the library or permanently change the composition of a material is desired, do so in this sheet.  The sheet contains instructions for modifying the materials library."]
[null,"HiddenSheet.  This sheet contains calculations and intermediates used by Excel's Solver to optimize the compost mix.  Do not change anything on this sheet.  This sheet is normally hidden from users."]
[null,"Documentation.  Sheet contains detailed technical documentation for the application.  This sheet will also be hidden from users.  Authors will print and archive this worksheet."]
[]
[null,"2.  System Requirements"]
[null,"Security - Excel 2003.  Due to changes in how Excel handles macros, there are separate versions of this application for Excel 2003 and for Excel 2007-2010.  You must have Microsoft Excel 2003 or later to run Spartan ATC Emergency Planner.  The spreadsheet contains macros, so MS Excel's security must be set to moderate or low to allow the macros to function.  To change the security setting select Tools > Macro > Security from Excel's main menu and set security to moderate or low.  Since macros are only loaded when a file is first opened, you need to close and reopen a file after changing Excel's macro security settings.  Depending on your security setting, Excel may ask you whether to enable or disable macros when you open the file.  Macros must be enabled for the application to work correctly. \n"]
[null,"Security - Excel 2007 and later. Due to changes in how Excel handles macros, there are separate versions of this application for Excel 2003 and for Excel 2007-2010.  You must have Microsoft Excel 2007 or later to run this version of Spartan ATC Emergency Planner. The spreadsheet contains macros, so MS Excel's security must be set to moderate or low to allow the macros to function.  To change the security setting select the Developer tab on Excel's main menu, then select 'Macro Security' from the toolbar and Tools > Macro > Security from Excel's main menu and set security to enable macros.  Depending on your security setting, Excel may ask you whether to enable or disable macros when you open the file.  Macros must be enabled for the application to work operate correctly.  "]
[null,"Solver - Excel 2003.  The Optimizer Worksheet also requires the Solver Add-in that is included with MS Excel.  Solver is not installed during the default installation of Excel so it may need to be added to your configuration of the program.  To determine if Solver is installed, select Tools from Excel's main menu.  If Solver is installed, it will be included in the Tools menu.  If Solver is not present on the Tools menu, it can be installed by selecting Add-ins from the Tools menu or from the Excel installation disk.  For additional installation details, search the Excel help system using the keyword \"Solver\"."]
[null,"Solver - Excel 2007 and later. The Optimizer Worksheet also requires the Solver Add-in that is included with MS Excel.  Solver is not installed during the default installation of Excel so it may need to be added to your configuration of the program.  To determine if Solver is installed, click the \"File\" tab on the top menu bar and select \"Options\" from the left navigation menu.  In the Options windows select The \"Add-Ins\" group. Then check that the \"Solver Add-in\" is included in the list of \"Active Application Add-ins\".  If it is not listed, Use the \"Manage\" dropdown for \"Excel Add-ins\" at the bottom of the window to Browse for the Add-in on your installation media for Excel.  For additional installation details, search the Excel help system using the keyword \"Solver\"."]
[]
[null,"3.  Planning a Compost Recipe or Mix"]
[null,"Steps 1 through 4 in the planning process are described below and are accomplished by entering invormation into green-colored cells within the Optimizer Worksheet."]
[null,"Step 1a.  Use the pull down menu to select each of the materials to be used in your compost mix and indicate whether the cost basis for each material will be set on a weight (lbs) or volume (cubic yard [yd3]) basis.  These settings have a significant impact on the final results of the optimized compost mixture.  Be sure that each of the materials rows you are not using has the \"Empty\" item (bottom of pull down list) selected."]
[null,"Step 1b.  The Optimizer Worksheet will insert default values for material characteristics and cost which have been stored in Materials Library Worksheet.  If desired, modify characterisitcs and cost values for your materials.  The characteristics that are most likely to change are percent moisture and cost.  Note again,  that cost can be set per unit of weight (lbs) or volume (yd3)."]
[null,"Step 2.  For animal tissue and limited amounts of materials, set the amount of each material to be included in the compost mix.  Two types of constraints are supported.  An “Equals” constraint for a material means that only the exact amount specified in the “Equals” constraint cell will be used in the mix during optimization.  A “Range” constraint means that at least the minimum constraint amount but not more than the maximum constraint amount of the material will be used in the mix during optimization.  Constraints on \"Empty\" material rows are ignored during optimization."]
[null,"Step 3.  If the information is known, it is possible to set performance constraints on percent moisture, C:N, and/or bulk density.  If this information is not available for the specific materials being used, the Optimizer will use default constraints which should provide acceptable composting activity.  In each case you can choose among no optimization, an “Equals” constraint, or a “Range” constraint."]
[null,"Step 4.  Enter the size of your loader bucket in cubic yards.  This information will be used to calculate the number of buckets of each material you will need to prepare your compost mix."]
{"$rows_left_out":23}
{"sheet":"Optimizer","index":1,"n_rows":86,"n_cols":26,"rows_kept":86,"cut":false,"hidden":false,"merged":[[81,2,81,6],[74,7,74,9],[51,23,51,25],[52,23,52,25],[78,7,78,9],[70,7,70,9],[71,7,71,9],[72,7,72,9],[76,7,76,9],[75,7,75,9],[51,14,51,15],[77,7,77,9],[67,7,67,9],[73,7,73,9],[67,3,67,5],[76,3,76,5],[7,4,7,6],[64,7,64,9],[65,7,65,9],[66,7,66,9],[35,3,35,5],[35,6,35,7],[36,6,36,7],[21,3,21,5],[21,7,21,8],[31,2,31,8],[40,2,40,7],[32,2,32,8],[21,14,21,16],[64,3,64,5],[65,3,65,5],[66,3,66,5],[65,14,65,17],[22,7,22,8],[57,23,57,25],[78,3,78,5],[70,3,70,5],[71,3,71,5],[72,3,72,5],[73,3,73,5],[74,3,74,5],[75,3,75,5],[77,3,77,5]]}
[]
[null,null,"Optimzer Worksheet for Spartan Compost Recipe Optimizer",null,null,null,null,null,null,null,null,null,null,"hide columns -------->",null,null,null,null,null,null,null,null,null,null,null," --- end hide columns  --->"]
[]
[null,"Step 1.","Select materials to use in compost mix and indicate whether material amounts and constraints will be in lbs or yds3."]
[null,null,"Adjust material composition and cost as needed."]
[null,null,"NOTE:  table cells with a green background are user inputs, white cells are calculated values."]
[]
[null,null,"Select Materials to Use","Mix","Cost",null,null,"Moisture","Carbon","Nitrogen","Bulk Density"]
[null,null,"in Compost Mix","Units","$","Amount","Units","%","% of wet wt","% of wet wt","lbs/yd3"]
[null,1,null,null,0,2000,null,0,0,0,0]
[null,2,null,null,0,2000,null,0,0,0,0]
[null,3,null,null,0,2000,null,0,0,0,0]
[null,4,null,null,0,2000,null,0,0,0,0]
[null,5,null,null,0,2000,null,0,0,0,0]
[null,6,null,null,0,2000,null,0,0,0,0]
[null,7,null,null,0,2000,null,0,0,0,0]
[null,8,null,null,0,2000,null,0,0,0,0]
[]
[null,"Step 2.","Set material constraints for each material in the mix."]
[null,null,"Constraint settings will be ignored for \"Empty\" material rows."]
[]
[null,null,"Materials in","Constraint Values",null,null,null,"Select Constraints",null,null,null,null,null,null,"Constraint Values in lbs"]
[null,null,"Compost Mix","Min","Equals","Max","Units","to Use",null,null,null,null,null,null,{"$f":"D23","v":"Min"},{"$f":"E23","v":"Equals"},{"$f":"F23","v":"Max"}]
[null,1,{"$f":"HiddenSheet!B18","v":"Empty"},0,1000,0,{"$f":"HiddenSheet!E18","v":"lbs"},null,null,null,null,null,null,null,{"$f":"IF(HiddenSheet!$D18=IsLbs,1,$K10) * D24","v":0},{"$f":"IF(HiddenSheet!$D18=IsLbs,1,$K10) * E24","v":1000},{"$f":"IF(HiddenSheet!$D18=IsLbs,1,$K10) * F24","v":0}]
[null,2,{"$f":"HiddenSheet!B19","v":"Empty"},0,0,20000,{"$f":"HiddenSheet!E19","v":"lbs"},null,null,null,null,null,null,null,{"$f":"IF(HiddenSheet!$D19=IsLbs,1,$K11) * D25","v":0},{"$f":"IF(HiddenSheet!$D19=IsLbs,1,$K11) * E25","v":0},{"$f":"IF(HiddenSheet!$D19=IsLbs,1,$K11) * F25","v":20000}]
[null,3,{"$f":"HiddenSheet!B20","v":"Empty"},0,0,20000,{"$f":"HiddenSheet!E20","v":"lbs"},null,null,null,null,null,null,null,{"$f":"IF(HiddenSheet!$D20=IsLbs,1,$K12) * D26","v":0},{"$f":"IF(HiddenSheet!$D20=IsLbs,1,$K12) * E26","v":0},{"$f":"IF(HiddenSheet!$D20=IsLbs,1,$K12) * F26","v":20000}]
[null,4,{"$f":"HiddenSheet!B21","v":"Empty"},0,0,20000,{"$f":"HiddenSheet!E21","v":"lbs"},null,null,null,null,null,null,null,{"$f":"IF(HiddenSheet!$D21=IsLbs,1,$K13) * D27","v":0},{"$f":"IF(HiddenSheet!$D21=IsLbs,1,$K13) * E27","v":0},{"$f":"IF(HiddenSheet!$D21=IsLbs,1,$K13) * F27","v":20000}]
[null,5,{"$f":"HiddenSheet!B22","v":"Empty"},0,0,20000,{"$f":"HiddenSheet!E22","v":"lbs"},null,null,null,null,null,null,null,{"$f":"IF(HiddenSheet!$D22=IsLbs,1,$K14) * D28","v":0},{"$f":"IF(HiddenSheet!$D22=IsLbs,1,$K14) * E28","v":0},{"$f":"IF(HiddenSheet!$D22=IsLbs,1,$K14) * F28","v":20000}]
[null,6,{"$f":"HiddenSheet!B23","v":"Empty"},0,0,20000,{"$f":"HiddenSheet!E23","v":"lbs"},null,null,null,null,null,null,null,{"$f":"IF(HiddenSheet!$D23=IsLbs,1,$K15) * D29","v":0},{"$f":"IF(HiddenSheet!$D23=IsLbs,1,$K15) * E29","v":0},{"$f":"IF(HiddenSheet!$D23=IsLbs,1,$K15) * F29","v":20000}]
[null,7,{"$f":"HiddenSheet!B24","v":"Empty"},0,0,20000,{"$f":"HiddenSheet!E24","v":"lbs"},null,null,null,null,null,null,null,{"$f":"IF(HiddenSheet!$D24=IsLbs,1,$K16) * D30","v":0},{"$f":"IF(HiddenSheet!$D24=IsLbs,1,$K16) * E30","v":0},{"$f":"IF(HiddenSheet!$D24=IsLbs,1,$K16) * F30","v":20000}]
{"$rows_left_out":57}
{"sheet":"Report","index":2,"n_rows":34,"n_cols":10,"rows_kept":34,"cut":false,"hidden":false,"merged":[[29,6,29,8],[30,6,30,8],[31,6,31,8],[32,6,32,8],[25,6,25,8],[26,6,26,8],[27,6,27,8],[28,6,28,8],[29,2,29,4],[30,2,30,4],[31,2,31,4],[32,2,32,4],[25,2,25,4],[26,2,26,4],[27,2,27,4],[28,2,28,4],[20,6,20,8],[21,6,21,8],[24,2,24,4],[24,6,24,8],[20,2,20,4],[21,2,21,4],[0,7,0,8],[18,2,18,4],[19,2,19,4],[18,6,18,8],[19,6,19,8]]}
[null,null,null,null,"Spartan Compost Recipe Optimizer",null,null,{"$f":"NOW()","v":"2018-07-09T14:18:46.590"}]
[]
[]
[null,"Materials in","Amount","Amount","Amount","Moisture","Carbon","Nitrogen","Bulk Density","Total"]
[null,"Compost Mix","lbs","yd3","buckets","%","% of wet wt","% of wet wt","lbs/yd3","Cost"]
[null,{"$f":"Optimizer!C54","v":"Empty"},{"$f":"Optimizer!O54","v":0},{"$f":"Optimizer!P54","v":0},{"$f":"Optimizer!F54","v":0},{"$f":"Optimizer!H10","v":0},{"$f":"Optimizer!I10","v":0},{"$f":"Optimizer!J10","v":0},{"$f":"Optimizer!I54","v":0},{"$f":"Optimizer!K54","v":0}]
[null,{"$f":"Optimizer!C55","v":"Empty"},{"$f":"Optimizer!O55","v":0},{"$f":"Optimizer!P55","v":0},{"$f":"Optimizer!F55","v":0},{"$f":"Optimizer!H11","v":0},{"$f":"Optimizer!I11","v":0},{"$f":"Optimizer!J11","v":0},{"$f":"Optimizer!I55","v":0},{"$f":"Optimizer!K55","v":0}]
[null,{"$f":"Optimizer!C56","v":"Empty"},{"$f":"Optimizer!O56","v":0},{"$f":"Optimizer!P56","v":0},{"$f":"Optimizer!F56","v":0},{"$f":"Optimizer!H12","v":0},{"$f":"Optimizer!I12","v":0},{"$f":"Optimizer!J12","v":0},{"$f":"Optimizer!I56","v":0},{"$f":"Optimizer!K56","v":0}]
[null,{"$f":"Optimizer!C57","v":"Empty"},{"$f":"Optimizer!O57","v":0},{"$f":"Optimizer!P57","v":0},{"$f":"Optimizer!F57","v":0},{"$f":"Optimizer!H13","v":0},{"$f":"Optimizer!I13","v":0},{"$f":"Optimizer!J13","v":0},{"$f":"Optimizer!I57","v":0},{"$f":"Optimizer!K57","v":0}]
[null,{"$f":"Optimizer!C58","v":"Empty"},{"$f":"Optimizer!O58","v":0},{"$f":"Optimizer!P58","v":0},{"$f":"Optimizer!F58","v":0},{"$f":"Optimizer!H14","v":0},{"$f":"Optimizer!I14","v":0},{"$f":"Optimizer!J14","v":0},{"$f":"Optimizer!I58","v":0},{"$f":"Optimizer!K58","v":0}]
[null,{"$f":"Optimizer!C59","v":"Empty"},{"$f":"Optimizer!O59","v":0},{"$f":"Optimizer!P59","v":0},{"$f":"Optimizer!F59","v":0},{"$f":"Optimizer!H15","v":0},{"$f":"Optimizer!I15","v":0},{"$f":"Optimizer!J15","v":0},{"$f":"Optimizer!I59","v":0},{"$f":"Optimizer!K59","v":0}]
[null,{"$f":"Optimizer!C60","v":"Empty"},{"$f":"Optimizer!O60","v":0},{"$f":"Optimizer!P60","v":0},{"$f":"Optimizer!F60","v":0},{"$f":"Optimizer!H16","v":0},{"$f":"Optimizer!I16","v":0},{"$f":"Optimizer!J16","v":0},{"$f":"Optimizer!I60","v":0},{"$f":"Optimizer!K60","v":0}]
[null,{"$f":"Optimizer!C61","v":"Empty"},{"$f":"Optimizer!O61","v":0},{"$f":"Optimizer!P61","v":0},{"$f":"Optimizer!F61","v":0},{"$f":"Optimizer!H17","v":0},{"$f":"Optimizer!I17","v":0},{"$f":"Optimizer!J17","v":0},{"$f":"Optimizer!I61","v":0},{"$f":"Optimizer!K61","v":0}]
[null,"Compost Mix Summary",{"$f":"SUM(C6:C13)","v":0},{"$f":"SUM(D6:D13)","v":0},{"$f":"SUM(E6:E13)","v":0},{"$f":"PercentMoisture","v":0},{"$f":"IF(C14>0,SUMPRODUCT(C6:C13,G6:G13)/C14,0)","v":0},{"$f":"IF(C14>0,SUMPRODUCT(C6:C13,H6:H13)/C14,0)","v":0},{"$f":"BulkDensity","v":0},{"$f":"Optimizer!K62","v":0}]
[null,null,null,null,null,null,null,null,"Total Cost/yd3",{"$f":"IF(D14>0,J14/D14,0)","v":0}]
[null,null,null,null,null,null,null,null,"Total cost/ton",{"$f":"IF(C14>0,J14/C14*2000,0)","v":0}]
[]
[null,"Performance Summary"]
[null,"Category","Constraints",null,null,"Mix","Recommendations"]
[null,{"$f":"Optimizer!C66","v":"Percent Moisture"},{"$f":"Optimizer!D66","v":"40 <= Percent Moisture <= 60"},null,null,{"$f":"Optimizer!G66","v":0},{"$f":"Optimizer!H66","v":"Increase percent moisture"}]
[null,{"$f":"Optimizer!C67","v":"Carbon : Nitrogen"},{"$f":"Optimizer!D67","v":"30 <= C:N <= 60"},null,null,{"$f":"Optimizer!G67","v":0},{"$f":"Optimizer!H67","v":"Add nitrogen or remove carbon"}]
[null,"Bulk Density (lbs/yd3)",{"$f":"Optimizer!D68","v":"No criteria set"},null,null,{"$f":"Optimizer!G68","v":0},{"$f":"Optimizer!H68","v":""}]
[]
[null,"Materials Summary"]
[null,"Material","Constraints",null,null,"Units","Recommendations"]
[null,{"$f":"Optimizer!C72","v":"Empty"},{"$f":"Optimizer!D72","v":""},null,null,{"$f":"Optimizer!G72","v":"lbs"},{"$f":"Optimizer!H72","v":""}]
[null,{"$f":"Optimizer!C73","v":"Empty"},{"$f":"Optimizer!D73","v":""},null,null,{"$f":"Optimizer!G73","v":"lbs"},{"$f":"Optimizer!H73","v":""}]
[null,{"$f":"Optimizer!C74","v":"Empty"},{"$f":"Optimizer!D74","v":""},null,null,{"$f":"Optimizer!G74","v":"lbs"},{"$f":"Optimizer!H74","v":""}]
[null,{"$f":"Optimizer!C75","v":"Empty"},{"$f":"Optimizer!D75","v":""},null,null,{"$f":"Optimizer!G75","v":"lbs"},{"$f":"Optimizer!H75","v":""}]
[null,{"$f":"Optimizer!C76","v":"Empty"},{"$f":"Optimizer!D76","v":""},null,null,{"$f":"Optimizer!G76","v":"lbs"},{"$f":"Optimizer!H76","v":""}]
{"$rows_left_out":5}
{"sheet":"Materials","index":3,"n_rows":65,"n_cols":9,"rows_kept":65,"cut":false,"hidden":false,"merged":[[62,0,62,9],[63,0,63,9],[64,0,64,9],[3,5,3,7],[59,0,59,9],[60,0,60,9],[61,0,61,9]]}
["Materials Library for Spartan Compost Recipe Optimizer"]
["Unless otherwise noted in cell comments, all material characteristics are from the On-Farm Composting Handbook, Appendix A."]
["Date Last Updated:"]
[null,"Moisture","Carbon","Nitrogen","Bulk Density","Cost",null,null,"Material"]
["Material","%","% of wet wt","% of wet wt","lbs/yd3","$","Amount","Units","Type"]
["Apple pomace",88,6.3360000000000003,0.13200000000000001,1559,100,2000,1,2]
["Bark/wood chips",85,10.8,0.03,532,100,2000,1,2]
["Blood wastes",78,10.78,3.08,1700,100,2000,1,2]
["Bovine carcass",70,14.98,2.76,1761.404908,50,1200,1,1]
["Broiler litter",35,25.48,1.82,890,100,2000,1,2]
["Butcher plant by-product",20.8,63.42,0.8,1535,100,2000,1,1]
["Corn cobs",15,49.98,0.51,560,100,2000,1,2]
["Corn silage",67,17.16,0.42900000000000005,560,100,2000,1,2]
["Corn stalks",12,40.655999999999999,0.61599999999999999,320,100,2000,1,2]
["Corn stover",30,31.32,0.45,630,100,2000,1,2]
["Corrugated cardboard",8,51.796000000000006,9.2000000000000012E-2,259,100,2000,1,2]
["Cottonseed meal",85,8.0850000000000009,1.155,800,100,2000,1,2]
["Dairy farm  'pen pack' manure",66.2,14.13,0.49,225.9,100,2000,1,2]
["Dairy farm calf hutch-pack' bedding/manure",63.77,11.81,0.43,182.4,100,2000,1,2]
["Dairy farm aisle scrap cow manure",83,6.76,0.37,321.89999999999998,100,2000,1,2]
["Dairy farm maternity pen bedding",70.099999999999994,8.07,0.27,155.5,100,2000,1,2]
["Dairy farm sawdust/woodwaste",52.95,21.26,1.01,286.2,100,2000,1,2]
["Dairy farm spoiled/rotten feed",70.099999999999994,13.33,0.68,118.1,100,2000,1,2]
["Dariy farm orts",51.67,16.72,0.85,378.9,100,2000,1,2]
["Food waste",69,11.625,0.77500000000000002,1400,100,2000,1,2]
["Fruit waste",80,11.2,0.28000000000000003,1500,100,2000,1,2]
["Grass clippings",82,10.404,0.61199999999999999,499.99999999999955,100,2000,1,2]
["Horse carcass",75,19,2.8,1700,10,1500,1,1]
["Horse manure",70,24.3,0.54,1215,100,2000,1,2]
["Laying hen litter",69,14.88,2.48,1479,100,2000,1,2]
{"$rows_left_out":36}
{"sheet":"HiddenSheet","index":4,"n_rows":90,"n_cols":14,"rows_kept":90,"cut":false,"hidden":true,"merged":[[15,1,15,2],[15,3,15,4],[48,3,48,10]]}
[null,"Menu lists, Constants, and intermediates used by application"]
[]
[null,"AmountInputs list for GUI"]
[null,"lbs",1]
[null,"yds",2]
[]
[null,"MaterialConstraintsList for GUI"]
[null,"Equals constraint",1]
[null,"Range constraint",2]
[]
[null,"PerformanceConstraintsList for GUI"]
[null,"no optimization",1]
[null,"Equals constraint",2]
[null,"Range constraint",3]
[]
[null,"Material",null,"Material Units",null,"Cost Units","Constraint","Material"]
[null,"Name","Index","Index","Value","Index","Index","Type"]
[1,"Empty",49,1,{"$f":"IF(D18=IsLbs,\"lbs\",\"yds\")","v":"lbs"},1,1,2]
[2,"Empty",49,1,{"$f":"IF(D19=IsLbs,\"lbs\",\"yds\")","v":"lbs"},1,2,2]
[3,"Empty",49,1,"lbs",1,2,2]
[4,"Empty",49,1,"lbs",1,2,2]
[5,"Empty",49,1,"lbs",1,2,2]
[6,"Empty",49,1,"lbs",1,2,2]
[7,"Empty",49,1,"lbs",1,2,2]
[8,"Empty",49,1,"lbs",1,2,2]
[]
[null,"Performance Constraints"]
[null,"Constraint",null,"Index"]
[null,"Percent Moisture",null,3]
[null,"Carbon : Nitrogen",null,3]
{"$rows_left_out":61}
{"sheet":"Documentation","index":5,"n_rows":93,"n_cols":3,"rows_kept":93,"cut":false,"hidden":true,"merged":[]}
[null,"Technical Documentation for Spartan Compost Optimizer"]
[]
[null,"Title"]
[null,"Spartan Compost Optimizer, An Excel spreadsheet that simplifies planning and optimizing compost recipes."]
[]
[null,"Authors"]
[null,"Principal Investigator: Dr. Dale Rozeboom, 2209I Anthony Hall, Department of Animal Science, Michigan State University, East Lansing, MI  48824.  e-mail: rozeboom@msu.edu"]
[null,"Programming: Robert Kriegel M.S., 3270B Anthony Hall, Department of Animal Science, Michigan State University, East Lansing, MI  48824.  e-mail: kriegelr@msu.edu"]
[]
[null,"Purpose"]
[null,"Spartan Compost Optimizer is a Microsoft® Office Excel application used to plan compost mixes.  It allows the user to automatically or manually optimize a compost recipe to meet performance and materials constraints while minimizing cost."]
[]
[null,"Copyright"]
[null,"Copyright 2013 © Michigan State University Board of Trustees.  All Rights Reserved."]
[]
[null,"Filename"]
[null,"Unprotected filename: Spartan_CompostOptimizer v1_00.xls"]
[null,"Protected filename: Spartan_CompostOptimizer.xls"]
[]
[null,"File Protection Password"]
[null,"Swine2Dirt"]
[]
[null,"Design goals"]
[null,"1.  Implement a MS Excel spreadsheet that simplifies the process of planning a compost mix."]
[null,"2.  Allow users to optimze a compost recipe to meet constraints on performance criteria and materials usage while minimizing the materials cost of the mix."]
[null,"3.  Implement a solution that promotes cost effective composting of animal waste on livestock and poultry operations, yet meets the compost planning needs of a much wider audience."]
[null,"4.  Use Excel's solver to automate the process of finding an optimal solution.  Existing spreadsheets force the user to manually set amounts for materials in a compost mix.  This trial and error process is time consuming, confusing to some users, and does not provide the user with adequate information to reduce materials costs.  Leveraging the power of Excel's solver will increase the efficiency of composting by saving the user's time, simplify planning, and allow users to better manage materials costs.  The automated optimization is a novel contribution to this problem space."]
[null,"5.  Package the solution in a user interface that is simple to use, intuitive, yet flexible enough to meet the needs of very diverse clientele and usages."]
[]
[null,"Specifications"]
{"$rows_left_out":63}